﻿"Dublin Core:Creator","Dublin Core:Contributor","Dublin Core:Title","Dublin Core:Alternative Title","Dublin Core:Is Part Of","Dublin Core:Date","Dublin Core:Date Issued","Dublin Core:Publisher","Dublin Core:Abstract","Dublin Core:Table Of Contents","Dublin Core:Subject","Dublin Core:Spatial Coverage","Dublin Core:Temporal Coverage","Dublin Core:Extent","Dublin Core:Type","Dublin Core:Language","Dublin Core:Access Rights","Dublin Core:License","Dublin Core:Relation","Dublin Core:Identifier","Dublin Core:Bibliographic Citation","Dublin Core:Source","Dublin Core:Rights","Dublin Core:Format","Dublin Core:Date Created","Dublin Core:Description","Dublin Core:Coverage","Dublin Core:Date Available","Dublin Core:Date Submitted","Dublin Core:Date Accepted","Dublin Core:Date Modified","Dublin Core:Date Valid","Dublin Core:Date Copyrighted","Dublin Core:Conforms To","Dublin Core:Has Format","Dublin Core:Has Part","Dublin Core:Has Version","Dublin Core:Is Format Of","Dublin Core:Is Referenced By","Dublin Core:Is Replaced By","Dublin Core:Is Required By","Dublin Core:Is Version Of","Dublin Core:Replaces","Dublin Core:References","Dublin Core:Requires","Dublin Core:Medium","Dublin Core:Accrual Method","Dublin Core:Accrual Periodicity","Dublin Core:Accrual Policy","Dublin Core:Audience","Dublin Core:Audience Education Level","Dublin Core:Mediator","Dublin Core:Provenance","Dublin Core:Instructional Method","Dublin Core:Rights Holder","Item Type Metadata:Text","Item Type Metadata:Duration","Item Type Metadata:Producer","Item Type Metadata:Director","Item Type Metadata:Duración","Item Type Metadata:Participantes","Item Type Metadata:Moderador","Item Type Metadata:Lugar de nacimiento","Item Type Metadata:Título o grado","Item Type Metadata:Institución de formación","Item Type Metadata:Actividad artística","Item Type Metadata:Área de investigación","Item Type Metadata:Otros perfiles","Item Type Metadata:Fecha de última actualización","Item Type Metadata:Fecha del evento","Item Type Metadata:Tipo de obra creativa","Item Type Metadata:Lugar del evento","Item Type Metadata:Ver video","Item Type Metadata:Notas","Item Type Metadata:Nombre alternativo de autor","Item Type Metadata:Nombre del evento","Item Type Metadata:Tipo de evento académico","Item Type Metadata:Día de publicación","Item Type Metadata:Generación","Item Type Metadata:Áreas de investigación sobre las comunidades chinas","Item Type Metadata:Código ORCID","Item Type Metadata:Scopus Author ID","Item Type Metadata:Otros perfiles académicos","Item Type Metadata:Exhibe su obra artística en","Item Type Metadata:Tipo de perfil","Item Type Metadata:Gestión cultural","Item Type Metadata:Annotated Region","Item Type Metadata:Ponentes","Item Type Metadata:Artículos en Tusanaje","Item Type Metadata:Reconocimientos","Item Type Metadata:Entrevistador","Item Type Metadata:Fecha de la entrevista","Item Type Metadata:Testimoniante","Item Type Metadata:Generación del testimoniante","Item Type Metadata:Lugar de origen del testimoniante","Item Type Metadata:Lugar de residencia del testimoniante","Item Type Metadata:Transcripción","Item Type Metadata:Versión del testimonio","Item Type Metadata:Registre sus apellidos y nombres","Item Type Metadata:Seleccione licencia de uso","Item Type Metadata:Contenido","Item Type Metadata:Contribución","Item Type Metadata:Exhibicion","Item Type Metadata:Multimedia","Item Type Metadata:Institución archivística","Item Type Metadata:Fondo","Item Type Metadata:Serie","Item Type Metadata:Subserie","Item Type Metadata:Ubicación topográfica","Item Type Metadata:Catalogación","Item Type Metadata:Productor","Item Type Metadata:Pensamientos","Item Type Metadata:ISBN",Miscellaneous:Miscellaneous,tags,file,itemType,collection,public,featured
"Lau, Pok Chi",,"Liria Maria Chao Garcia 周春媖",,"Serie fotográfica Chinos cubanos (Pok Chi Lau)",,2009,,"Liria Maria Chao Garcia 周春媖 ciudadana cubana fue retratada en 2009 en Cuba por el fotógrafo documental Pok Chi Lau 劉博智. Su fotografía forma parte de la serie fotográfica Chinos cubanos concebida por el autor para mostrar los rostros multirraciales de los chinos cubanos y la relación filial con sus ancestros chinos.",,"Retratos ",Cuba,"Siglo XXI",,Imagen,,info:eu-repo/semantics/openAccess,"<a href=""https://rightsstatements.org/page/InC-EDU/1.0/"" target=""_blank"" rel=""noopener"">Rights Statements Protegido por derecho de autor - Uso educativo permitido</a>",,164,,,,,,,,,,,,,,,,,,,,,,,,,,,,,,,,,,,,,,,,,,,,,,,,,,,"Fotografía documental",,,"Entiéndase la fecha de publicación como la fecha de creación.",,,,,,,,,,,,,,,,,,,,,,,,,,,,"Pok Chi Lau 劉博智",,,,,,,,,,,,,"Antepasados,Chinos cubanos,Mestizaje,Mujeres descendientes,Retratos",https://tusanaje.org/biblioteca/files/original/7/164/IMG_2009_Pok_Chi_Lau_rostros_24.jpg,Imagen,"Retratos desde Cuba",1,0
"Lau, Pok Chi",,"Lay brothers in Sagua la Grande",沙瓜賴(黎)氏兄弟,"Serie fotográfica Chinos cubanos (Pok Chi Lau)",,2009,,"Los hermanos Lay 黎 ciudadanos cubanos de ascendencia china fueron retratados en 2009 en Sagua la Grande, Cuba por el fotógrafo documental Pok Chi Lau 劉博智. Su fotografía forma parte de la serie fotográfica Chinos cubanos concebida por el autor para mostrar los rostros multirraciales de los chinos cubanos y la relación filial con sus ancestros chinos.",,Retratos,Cuba,"Siglo XXI",,Imagen,,info:eu-repo/semantics/openAccess,"<a href=""https://rightsstatements.org/page/InC-EDU/1.0/"" target=""_blank"" rel=""noopener"">Rights Statements Protegido por derecho de autor - Uso educativo permitido</a>",,169,,,,,,,,,,,,,,,,,,,,,,,,,,,,,,,,,,,,,,,,,,,,,,,,,,,"Fotografía documental",,,"Entiéndase la fecha de publicación como la fecha de creación.",,,,,,,,,,,,,,,,,,,,,,,,,,,,"Pok Chi Lau 劉博智",,,,,,,,,,,,,"Chinos cubanos,Descendientes,Mestizaje,Retratos",https://tusanaje.org/biblioteca/files/original/7/169/IMG_2009_Pok_Chi_Lau_rostros_28.jpg,Imagen,"Retratos desde Cuba",1,0
"Lau, Pok Chi",,"La tercera y cuarta generación de Wong Leon Wai en Sagua la Grande","沙瓜黃麟偉第三、四代後人 ","Serie fotográfica Chinos cubanos (Pok Chi Lau)",,2009,,"Los descendientes de la tercera y cuarta generación de Wong Leon Wai 黃麟偉 fueron retratados en 2009 en Sagua la Grande, Cuba por el fotógrafo documental Pok Chi Lau 劉博智. Su fotografía forma parte de la serie fotográfica Chinos cubanos concebida por el autor para mostrar los rostros multirraciales de los chinos cubanos y la relación filial con sus ancestros chinos.",,Retratos,Cuba,"Siglo XXI",,Imagen,,info:eu-repo/semantics/openAccess,"<a href=""https://rightsstatements.org/page/InC-EDU/1.0/"" target=""_blank"" rel=""noopener"">Rights Statements Protegido por derecho de autor - Uso educativo permitido</a>",,153,,,,,,,,,,,,,,,,,,,,,,,,,,,,,,,,,,,,,,,,,,,,,,,,,,,"Fotografía documental",,,"Entiéndase la fecha de publicación como la fecha de creación.",,,,,,,,,,,,,,,,,,,,,,,,,,,,"Pok Chi Lau 劉博智",,,,,,,,,,,,,"Antepasados,Chinos cubanos,Descendientes,Familia,Mestizaje,Retratos",https://tusanaje.org/biblioteca/files/original/7/153/IMG_2009_Pok_Chi_Lau_rostros_13.jpg,Imagen,"Retratos desde Cuba",1,0
"Lau, Pok Chi",,"Julio Wong ",,"Serie fotográfica Chinos cubanos (Pok Chi Lau)",,2009,,"Julio Wong 黃 muestra la fotografía de abuelo Fernando Wong. Fue retratado  por el fotógrafo documental Pok Chi Lau 劉博智 en Cuba en el año 2009. Su fotografía forma parte de la serie fotográfica Chinos cubanos concebida por el autor para mostrar los rostros multirraciales de los chinos cubanos y la relación filial con sus ancestros chinos.",,Retratos,Cuba,"Siglo XXI",,Imagen,,info:eu-repo/semantics/openAccess,"<a href=""https://rightsstatements.org/page/InC-EDU/1.0/"" target=""_blank"" rel=""noopener"">Rights Statements Protegido por derecho de autor - Uso educativo permitido</a>",,181,,,,,,,,,,,,,,,,,,,,,,,,,,,,,,,,,,,,,,,,,,,,,,,,,,,"Fotografía documental",,,"Entiéndase la fecha de publicación como la fecha de creación.",,,,,,,,,,,,,,,,,,,,,,,,,,,,"Pok Chi Lau 劉博智",,,,,,,,,,,,,"Antepasados,Chinos cubanos,Descendientes,Mestizaje,Retratos",https://tusanaje.org/biblioteca/files/original/7/181/IMG_2009_Pok_Chi_Lau_rostros_42.jpg,Imagen,"Retratos desde Cuba",1,0
"Lau, Pok Chi",,"Jose Fong Amaran",,"Serie fotográfica Chinos cubanos (Pok Chi Lau)",,2009,,"Jose Fong Amaran, padre de Yamil Fong Dinza e hijo de la actriz cubana de ópera cantonesa Caridad Amaran (Hou Chou Lan 何秋兰), muestra una fotografía de sus padres. Fue retratado por el fotógrafo documental Pok Chi Lau 劉博智 en Cuba en el año 2009. Su fotografía forma parte de la serie fotográfica Chinos cubanos concebida por el autor para mostrar los rostros multirraciales de los chinos cubanos y la relación filial con sus ancestros chinos.",,Retratos,Cuba,"Siglo XXI",,Imagen,,info:eu-repo/semantics/openAccess,"<a href=""https://rightsstatements.org/page/InC-EDU/1.0/"" target=""_blank"" rel=""noopener"">Rights Statements Protegido por derecho de autor - Uso educativo permitido</a>",,185,,,,,,,,,,,,,,,,,,,,,,,,,,,,,,,,,,,,,,,,,,,,,,,,,,,"Fotografía documental",,,"Entiéndase la fecha de publicación como la fecha de creación.",,,,,,,,,,,,,,,,,,,,,,,,,,,,"Pok Chi Lau 劉博智",,,,,,,,,,,,,"Antepasados,Chinos cubanos,Mestizaje,Retratos",https://tusanaje.org/biblioteca/files/original/7/185/IMG_2009_Pok_Chi_Lau_rostros_45.jpg,Imagen,"Retratos desde Cuba",1,0
"Lau, Pok Chi",,"Husband and wife",,"Serie fotográfica Chinos cubanos (Pok Chi Lau)",,2009,,"Anciana junto a la fotografía de su esposo Huang Lin Wei 黃麟偉 . Fue retratada en 2009 en Cuba por el fotógrafo documental Pok Chi Lau 劉博智. Su fotografía forma parte de la serie fotográfica Chinos cubanos concebida por el autor para mostrar los rostros multirraciales de los chinos cubanos y la relación filial con sus ancestros chinos.",,Retratos,Cuba,"Siglo XXI",,Imagen,,info:eu-repo/semantics/openAccess,"<a href=""https://rightsstatements.org/page/InC-EDU/1.0/"" target=""_blank"" rel=""noopener"">Rights Statements Protegido por derecho de autor - Uso educativo permitido</a>",,154,,,,,,,,,,,,,,,,,,,,,,,,,,,,,,,,,,,,,,,,,,,,,,,,,,,"Fotografía documental",,,"Entiéndase la fecha de publicación como la fecha de creación.",,,,,,,,,,,,,,,,,,,,,,,,,,,,"Pok Chi Lau 劉博智",,,,,,,,,,,,,"Chinos cubanos,Familia,Mestizaje,Retratos",https://tusanaje.org/biblioteca/files/original/7/154/IMG_2009_Pok_Chi_Lau_rostros_14.jpg,Imagen,"Retratos desde Cuba",1,0
"Lau, Pok Chi",,"Hilda Yi Valdosola ",,"Serie fotográfica Chinos cubanos (Pok Chi Lau)",,2009,,"Hilda Yi Valdosola 余清姿, una violinista de una orquesta cubana, muestra una fotografía de sus padres. Fue retratada por el fotógrafo documental Pok Chi Lau 劉博智 en Cuba en el año 2009. Su fotografía forma parte de la serie fotográfica Chinos cubanos concebida por el autor para mostrar los rostros multirraciales de los chinos cubanos y la relación filial con sus ancestros chinos.",,Retratos,Cuba,"Siglo XXI",,Imagen,,info:eu-repo/semantics/openAccess,"<a href=""https://rightsstatements.org/page/InC-EDU/1.0/"" target=""_blank"" rel=""noopener"">Rights Statements Protegido por derecho de autor - Uso educativo permitido</a>",,217,,,,,,,,,,,,,,,,,,,,,,,,,,,,,,,,,,,,,,,,,,,,,,,,,,,"Fotografía documental",,,"Entiéndase la fecha de publicación como la fecha de creación.",,,,,,,,,,,,,,,,,,,,,,,,,,,,"Pok Chi Lau 劉博智",,,,,,,,,,,,,"Chinos cubanos,Mestizaje,Retratos",https://tusanaje.org/biblioteca/files/original/7/217/IMG_2009_Pok_Chi_Lau_rostros_76.jpg,Imagen,"Retratos desde Cuba",1,0
"Lau, Pok Chi",,"Hilda Chiu muestra una fotografía",,"Serie fotográfica Chinos cubanos (Pok Chi Lau)",,2009,,"Hilda Chiu muestra una fotografía de su padre. Fue retratada por el fotógrafo documental Pok Chi Lau 劉博智 en Cuba en el año 2009. Su fotografía forma parte de la serie fotográfica Chinos cubanos concebida por el autor para mostrar los rostros multirraciales de los chinos cubanos y la relación filial con sus ancestros chinos.",,Retratos,Cuba,"Siglo XXI",,Imagen,,info:eu-repo/semantics/openAccess,"<a href=""https://rightsstatements.org/page/InC-EDU/1.0/"" target=""_blank"" rel=""noopener"">Rights Statements Protegido por derecho de autor - Uso educativo permitido</a>",,216,,,,,,,,,,,,,,,,,,,,,,,,,,,,,,,,,,,,,,,,,,,,,,,,,,,"Fotografía documental",,,"Fotografía de Pok Chi Lau sin título original. El título fue asignado por la Biblioteca digital IdenTusanes.",,,,,,,,,,,,,,,,,,,,,,,,,,,,"Pok Chi Lau 劉博智",,,,,,,,,,,,,"Chinos cubanos,Mestizaje,Retratos",https://tusanaje.org/biblioteca/files/original/7/216/IMG_2009_Pok_Chi_Lau_rostros_75.jpg,Imagen,"Retratos desde Cuba",1,0
"Lau, Pok Chi",,"Hilda Chiu",,"Serie fotográfica Chinos cubanos (Pok Chi Lau)",,2009,,"Hilda Chiu fue retratada por el fotógrafo documental Pok Chi Lau 劉博智 en Cuba en el año 2009. Su fotografía forma parte de la serie fotográfica Chinos cubanos concebida por el autor para mostrar los rostros multirraciales de los chinos cubanos y la relación filial con sus ancestros chinos.",,Retratos,Cuba,"Siglo XXI",,Imagen,,info:eu-repo/semantics/openAccess,"<a href=""https://rightsstatements.org/page/InC-EDU/1.0/"" target=""_blank"" rel=""noopener"">Rights Statements Protegido por derecho de autor - Uso educativo permitido</a>",,215,,,,,,,,,,,,,,,,,,,,,,,,,,,,,,,,,,,,,,,,,,,,,,,,,,,"Fotografía documental",,,"Entiéndase la fecha de publicación como la fecha de creación.",,,,,,,,,,,,,,,,,,,,,,,,,,,,"Pok Chi Lau 劉博智",,,,,,,,,,,,,"Chinos cubanos,Mestizaje,Retratos",https://tusanaje.org/biblioteca/files/original/7/215/IMG_2009_Pok_Chi_Lau_rostros_74.jpg,Imagen,"Retratos desde Cuba",1,0
"Lau, Pok Chi",,"Hijo de Lai Jyu Wai ",,"Serie fotográfica Chinos cubanos (Pok Chi Lau)",,2009,,"Un hombre de apellido Lai muestra un documento con la fotografía de su padre Lai Jyu Wai 黎如惠. Fue retratada  por el fotógrafo documental Pok Chi Lau 劉博智 en Cuba en el año 2009. Su fotografía forma parte de la serie fotográfica Chinos cubanos concebida por el autor para mostrar los rostros multirraciales de los chinos cubanos y la relación filial con sus ancestros chinos.",,Retratos,Cuba,"Siglo XXI",,Imagen,,info:eu-repo/semantics/openAccess,"<a href=""https://rightsstatements.org/page/InC-EDU/1.0/"" target=""_blank"" rel=""noopener"">Rights Statements Protegido por derecho de autor - Uso educativo permitido</a>",,209,,,,,,,,,,,,,,,,,,,,,,,,,,,,,,,,,,,,,,,,,,,,,,,,,,,"Fotografía documental",,,"Entiéndase la fecha de publicación como la fecha de creación.",,,,,,,,,,,,,,,,,,,,,,,,,,,,"Pok Chi Lau 劉博智",,,,,,,,,,,,,"Antepasados,Chinos cubanos,Retratos",https://tusanaje.org/biblioteca/files/original/7/209/IMG_2009_Pok_Chi_Lau_rostros_69.jpg,Imagen,"Retratos desde Cuba",1,0
